Reaction Details
TargetAdenosine receptor A2a
LigandBDBM50369981
Substrate/Competitorn/a
Meas. Tech.ChEMBL_30008 (CHEMBL641299)
Ki 12.8±n/a nM
Citation Rieger, JMBrown, MLSullivan, GWLinden, JMacdonald, TL Design, synthesis, and evaluation of novel A2A adenosine receptor agonists. J Med Chem44:531-9 (2001) Adenosine receptor A2a
Name:Adenosine receptor A2a
Type:G Protein-Coupled Receptor (GPCR)
Mol. Mass.:45015.65
Organism:Rattus norvegicus (rat)
Description:Rat A2A receptors expressed in CHO cells.
Residue:410
BDBM50369981
NameBDBM50369981
Synonyms:CHEMBL608947
TypeSmall organic molecule
Emp. Form.C15H23N5O5
Mol. Mass.353.3736
SMILESCCOCCCc1nc(N)c2ncn(C3O[C@H](CO)[C@@H](O)[C@H]3O)c2n1