Reaction Details
TargetAdenosine receptor A2a
LigandBDBM50369979
Substrate/Competitorn/a
Meas. Tech.ChEMBL_30008 (CHEMBL641299)
Ki 39±n/a nM
Citation Rieger, JMBrown, MLSullivan, GWLinden, JMacdonald, TL Design, synthesis, and evaluation of novel A2A adenosine receptor agonists. J Med Chem44:531-9 (2001) Adenosine receptor A2a
Name:Adenosine receptor A2a
Type:G Protein-Coupled Receptor (GPCR)
Mol. Mass.:45015.65
Organism:Rattus norvegicus (rat)
Description:Rat A2A receptors expressed in CHO cells.
Residue:410
BDBM50369979
NameBDBM50369979
Synonyms:CHEMBL611290
TypeSmall organic molecule
Emp. Form.C19H23N5O5
Mol. Mass.401.4164
SMILESCc1ccccc1CCOc1nc(N)c2ncn(C3O[C@H](CO)[C@@H](O)[C@H]3O)c2n1