Reaction Details
TargetAlpha-1D adrenergic receptor
LigandBDBM50370020
Substrate/Competitorn/a
Meas. Tech.ChEMBL_33678 (CHEMBL646819)
Ki 0.09±n/a nM
Citation Boyd, REPress, JBRasmussen, CRRaffa, RBCodd, EEConnelly, CDLi, QSMartinez, RPLewis, MAAlmond, HRReitz, AB Alpha(2) adrenoceptor agonists as potential analgesic agents. 3. Imidazolylmethylthiophenes. J Med Chem44:863-72 (2001) Alpha-1D adrenergic receptor
Name:Alpha-1D adrenergic receptor
Type:Enzyme Catalytic Domain
Mol. Mass.:60485.82
Organism:Homo sapiens (Human)
Description:adrenergic Alpha1D ADRA1D HUMAN::P25100
Residue:572
BDBM50370020
NameBDBM50370020
Synonyms:CHEMBL1744270
TypeSmall organic molecule
Emp. Form.C12H10N2S
Mol. Mass.214.286
SMILESC(c1cnc[nH]1)c1csc2ccccc12