Reaction Details
TargetAlpha-1D adrenergic receptor
LigandBDBM50370036
Substrate/Competitorn/a
Meas. Tech.ChEMBL_33678 (CHEMBL646819)
Ki 0.07±n/a nM
Citation Boyd, REPress, JBRasmussen, CRRaffa, RBCodd, EEConnelly, CDLi, QSMartinez, RPLewis, MAAlmond, HRReitz, AB Alpha(2) adrenoceptor agonists as potential analgesic agents. 3. Imidazolylmethylthiophenes. J Med Chem44:863-72 (2001) Alpha-1D adrenergic receptor
Name:Alpha-1D adrenergic receptor
Type:Enzyme Catalytic Domain
Mol. Mass.:60485.82
Organism:Homo sapiens (Human)
Description:adrenergic Alpha1D ADRA1D HUMAN::P25100
Residue:572
BDBM50370036
NameBDBM50370036
Synonyms:CHEMBL1203855
TypeSmall organic molecule
Emp. Form.C8H6Br2N2S
Mol. Mass.322.02
SMILESBrc1csc(Cc2cnc[nH]2)c1Br