Reaction Details
TargetAlpha-1D adrenergic receptor
LigandBDBM50098355
Substrate/Competitorn/a
Meas. Tech.ChEMBL_33678 (CHEMBL646819)
Ki 0.780±n/a nM
Citation Boyd, REPress, JBRasmussen, CRRaffa, RBCodd, EEConnelly, CDLi, QSMartinez, RPLewis, MAAlmond, HRReitz, AB Alpha(2) adrenoceptor agonists as potential analgesic agents. 3. Imidazolylmethylthiophenes. J Med Chem44:863-72 (2001) Alpha-1D adrenergic receptor
Name:Alpha-1D adrenergic receptor
Type:Enzyme Catalytic Domain
Mol. Mass.:60485.82
Organism:Homo sapiens (Human)
Description:adrenergic Alpha1D ADRA1D HUMAN::P25100
Residue:572
BDBM50098355
NameBDBM50098355
Synonyms:4-[1-(3-Methyl-thiophen-2-yl)-ethyl]-1H-imidazole CHEMBL1237160 | CHEMBL170960
TypeSmall organic molecule
Emp. Form.C10H12N2S
Mol. Mass.192.281
SMILESCC(c1cnc[nH]1)c1sccc1C