Reaction Details
TargetProthrombin
LigandBDBM50098235
Substrate/Competitorn/a
Meas. Tech.ChEMBL_208322 (CHEMBL812840)
Ki 0.38±n/a nM
Citation Pierce, ACJorgensen, WL Estimation of binding affinities for selective thrombin inhibitors via Monte Carlo simulations. J Med Chem44:1043-50 (2001) Prothrombin
Name:Prothrombin
Type:Protein
Mol. Mass.:70029.57
Organism:Homo sapiens (Human)
Description:P00734
Residue:622
BDBM50098235
NameBDBM50098235
Synonyms:3-[4-(Amino-hydrazino-methyl)-phenyl]-N-cyclopentyl-N-methyl-2-(naphthalene-2-sulfonylamino)-propionamide | CHEMBL269206
TypeSmall organic molecule
Emp. Form.C26H33N5O3S
Mol. Mass.495.637
SMILESCN(C1CCCC1)C(=O)[C@H](Cc1ccc(cc1)C(N)NN)NS(=O)(=O)c1ccc2ccccc2c1