Reaction Details
TargetNeutrophil elastase
LigandBDBM50095519
Substrate/Competitorn/a
Meas. Tech.ChEMBL_63965 (CHEMBL677434)
Ki 1.18±n/a nM
Citation Ohmoto, KYamamoto, TOkuma, MHoriuchi, TImanishi, HOdagaki, YKawabata, KSekioka, THirota, YMatsuoka, SNakai, HToda, MCheronis, JCSpruce, LWGyorkos, AWieczorek, M Development of orally active nonpeptidic inhibitors of human neutrophil elastase. J Med Chem44:1268-85 (2001) Neutrophil elastase
Name:Neutrophil elastase
Type:Enzyme
Mol. Mass.:28532.38
Organism:Homo sapiens (Human)
Description:P08246
Residue:267
BDBM50095519
NameBDBM50095519
Synonyms:(S)-2-[5-Amino-2-(4-fluoro-phenyl)-6-oxo-6H-pyrimidin-1-yl]-N-{1-[5-(1-benzo[1,3]dioxol-5-yl-1-methyl-ethyl)-[1,3,4]oxadiazole-2-carbonyl]-2-methyl-propyl}-acetamide with 0.5 moles of H20 CHEMBL279941
TypeSmall organic molecule
Emp. Form.C29H29FN6O6
Mol. Mass.576.5756
SMILESCC(C)[C@H](NC(=O)Cn1c(ncc(N)c1=O)-c1ccc(F)cc1)C(=O)c1nnc(o1)C(C)(C)c1ccc2OCOc2c1