Reaction Details
TargetNeutrophil elastase
LigandBDBM50095520
Substrate/Competitorn/a
Meas. Tech.ChEMBL_63965 (CHEMBL677434)
Ki 6.38±n/a nM
Citation Ohmoto, KYamamoto, TOkuma, MHoriuchi, TImanishi, HOdagaki, YKawabata, KSekioka, THirota, YMatsuoka, SNakai, HToda, MCheronis, JCSpruce, LWGyorkos, AWieczorek, M Development of orally active nonpeptidic inhibitors of human neutrophil elastase. J Med Chem44:1268-85 (2001) Neutrophil elastase
Name:Neutrophil elastase
Type:Enzyme
Mol. Mass.:28532.38
Organism:Homo sapiens (Human)
Description:P08246
Residue:267
BDBM50095520
NameBDBM50095520
Synonyms:(S)-2-(5-amino-2-(4-fluorophenyl)-6-oxopyrimidin-1(6H)-yl)-N-(1-(5-tert-butyl-1,3,4-oxadiazol-2-yl)-3-methyl-1-oxobutan-2-yl)acetamide 2-[5-Amino-2-(4-fluoro-phenyl)-6-oxo-6H-pyrimidin-1-yl]-N-[1-(5-tert-butyl-[1,3,4]oxadiazole-2-carbonyl)-2-methyl-propyl]-acetamide | CHEMBL282705
TypeSmall organic molecule
Emp. Form.C23H27FN6O4
Mol. Mass.470.4967
SMILESCC(C)[C@H](NC(=O)Cn1c(ncc(N)c1=O)-c1ccc(F)cc1)C(=O)c1nnc(o1)C(C)(C)C