Reaction Details
TargetNeutrophil elastase
LigandBDBM50098825
Substrate/Competitorn/a
Meas. Tech.ChEMBL_63965 (CHEMBL677434)
Ki 730±n/a nM
Citation Ohmoto, KYamamoto, TOkuma, MHoriuchi, TImanishi, HOdagaki, YKawabata, KSekioka, THirota, YMatsuoka, SNakai, HToda, MCheronis, JCSpruce, LWGyorkos, AWieczorek, M Development of orally active nonpeptidic inhibitors of human neutrophil elastase. J Med Chem44:1268-85 (2001) Neutrophil elastase
Name:Neutrophil elastase
Type:Enzyme
Mol. Mass.:28532.38
Organism:Homo sapiens (Human)
Description:P08246
Residue:267
BDBM50098825
NameBDBM50098825
Synonyms:CHEMBL284433 | N-[1-(5-tert-Butyl-[1,3,4]oxadiazole-2-carbonyl)-2-methyl-propyl]-2-(4-isobutyl-2,5-dioxo-imidazolidin-1-yl)-acetamide
TypeSmall organic molecule
Emp. Form.C20H31N5O5
Mol. Mass.421.4906
SMILESCC(C)Cc1[nH]c(=O)n(CC(=O)N[C@@H](C(C)C)C(=O)c2nnc(o2)C(C)(C)C)c1O