Reaction Details
TargetNeutrophil elastase
LigandBDBM50095527
Substrate/Competitorn/a
Meas. Tech.ChEMBL_63965 (CHEMBL677434)
Ki 3.59±n/a nM
Citation Ohmoto, KYamamoto, TOkuma, MHoriuchi, TImanishi, HOdagaki, YKawabata, KSekioka, THirota, YMatsuoka, SNakai, HToda, MCheronis, JCSpruce, LWGyorkos, AWieczorek, M Development of orally active nonpeptidic inhibitors of human neutrophil elastase. J Med Chem44:1268-85 (2001) Neutrophil elastase
Name:Neutrophil elastase
Type:Enzyme
Mol. Mass.:28532.38
Organism:Homo sapiens (Human)
Description:P08246
Residue:267
BDBM50095527
NameBDBM50095527
Synonyms:(S)-2-(5-Amino-6-oxo-2-phenyl-6H-pyrimidin-1-yl)-N-[1-(5-tert-butyl-[1,3,4]oxadiazole-2-carbonyl)-2-methyl-propyl]-acetamidewith 0.2 moles of H20 2-(5-Amino-6-oxo-2-phenyl-6H-pyrimidin-1-yl)-N-[1-(5-tert-butyl-[1,3,4]oxadiazole-2-carbonyl)-2-methyl-propyl]-acetamide | CHEMBL23234
TypeSmall organic molecule
Emp. Form.C23H28N6O4
Mol. Mass.452.5062
SMILESCC(C)[C@H](NC(=O)Cn1c(ncc(N)c1=O)-c1ccccc1)C(=O)c1nnc(o1)C(C)(C)C