Reaction Details
TargetNeutrophil elastase
LigandBDBM50095521
Substrate/Competitorn/a
Meas. Tech.ChEMBL_63965 (CHEMBL677434)
Ki 0.64±n/a nM
Citation Ohmoto, KYamamoto, TOkuma, MHoriuchi, TImanishi, HOdagaki, YKawabata, KSekioka, THirota, YMatsuoka, SNakai, HToda, MCheronis, JCSpruce, LWGyorkos, AWieczorek, M Development of orally active nonpeptidic inhibitors of human neutrophil elastase. J Med Chem44:1268-85 (2001) Neutrophil elastase
Name:Neutrophil elastase
Type:Enzyme
Mol. Mass.:28532.38
Organism:Homo sapiens (Human)
Description:P08246
Residue:267
BDBM50095521
NameBDBM50095521
Synonyms:(S)-2-[5-Amino-2-(4-fluoro-phenyl)-6-oxo-6H-pyrimidin-1-yl]-N-{2-methyl-1-[5-(3-methyl-benzyl)-[1,3,4]oxadiazole-2-carbonyl]-propyl}-acetamide 2-[5-amino-2-(4-fluoro-phenyl)-6-oxo-6H-pyrimidin-1-yl]-N-{(S)-2-methyl-1-[5-(3-methyl-benzyl)-[1,3,4]oxadiazole-2-carbonyl]-propyl}-acetamide | CHEMBL283168
TypeSmall organic molecule
Emp. Form.C27H27FN6O4
Mol. Mass.518.5395
SMILESCC(C)[C@H](NC(=O)Cn1c(ncc(N)c1=O)-c1ccc(F)cc1)C(=O)c1nnc(Cc2cccc(C)c2)o1