Reaction Details
TargetSomatostatin receptor type 4
LigandBDBM50370062
Substrate/Competitorn/a
Meas. Tech.ChEMBL_200842 (CHEMBL807052)
Ki 2±n/a nM
Citation Rajeswaran, WGHocart, SJMurphy, WATaylor, JECoy, DH Highly potent and subtype selective ligands derived by N-methyl scan of a somatostatin antagonist. J Med Chem44:1305-11 (2001) Somatostatin receptor type 4
Name:Somatostatin receptor type 4
Type:Enzyme
Mol. Mass.:42015.38
Organism:Homo sapiens (Human)
Description:P31391
Residue:388
BDBM50370062
NameBDBM50370062
Synonyms:CHEMBL1794035
TypeSmall organic molecule
Emp. Form.C76H104N18O19S2
Mol. Mass.1637.878
SMILESC[C@@H](O)[C@H]1NC(=O)[C@H](Cc2ccccc2)NC(=O)[C@H](NC(=O)[C@H](CCCCN)NC(=O)[C@@H](Cc2c[nH]c3ccccc23)NC(=O)[C@H](Cc2ccccc2)NC(=O)[C@@H](Cc2ccccc2)NC(=O)[C@H](CC(N)=O)NC(=O)[C@@H](CCCCN)NC(=O)[C@@H](CSSC[C@H](NC(=O)[C@H](CO)NC1=O)C(O)=O)NC(=O)CNC(=O)[C@H](C)N)[C@H](C)O