Reaction Details
TargetSomatostatin receptor type 5
LigandBDBM50370064
Substrate/Competitorn/a
Meas. Tech.ChEMBL_200860 (CHEMBL807069)
Ki 5.98±n/a nM
Citation Rajeswaran, WGHocart, SJMurphy, WATaylor, JECoy, DH Highly potent and subtype selective ligands derived by N-methyl scan of a somatostatin antagonist. J Med Chem44:1305-11 (2001) Somatostatin receptor type 5
Name:Somatostatin receptor type 5
Type:Enzyme
Mol. Mass.:39218.02
Organism:Homo sapiens (Human)
Description:P35346
Residue:364
BDBM50370064
NameBDBM50370064
Synonyms:CHEMBL1794040
TypeSmall organic molecule
Emp. Form.C58H69ClN12O9S2
Mol. Mass.1177.826
SMILESC[C@H](O)[C@H]1NC(=O)[C@H](CCCCN)N(C)C(=O)[C@@H](Cc2c[nH]c3ccccc23)NC(=O)C(Cc2cccnc2)NC(=O)[C@H](CSSC[C@@H](NC1=O)C(=O)NC(Cc1ccc2ccccc2c1)C(N)=O)NC(=O)C(N)Cc1ccc(Cl)cc1