Reaction Details
TargetGlucocorticoid receptor
LigandBDBM50113781
Substrate/Competitorn/a
Meas. Tech.ChEMBL_71395 (CHEMBL681747)
Ki 157±n/a nM
Citation Morgan, BPSwick, AGHargrove, DMLaFlamme, JAMoynihan, MSCarroll, RSMartin, KALee, EDecosta, DBordner, J Discovery of potent, nonsteroidal, and highly selective glucocorticoid receptor antagonists. J Med Chem45:2417-24 (2002) Glucocorticoid receptor
Name:Glucocorticoid receptor
Type:Enzyme
Mol. Mass.:85656.87
Organism:Homo sapiens (Human)
Description:P04150
Residue:777
BDBM50113781
NameBDBM50113781
Synonyms:(R)-4a-Benzyl-7-hydroxy-4,4a,9,10-tetrahydro-3H-phenanthren-2-one | CHEMBL78646
TypeSmall organic molecule
Emp. Form.C21H20O2
Mol. Mass.304.3823
SMILESOc1ccc2c(CCC3=CC(=O)CC[C@@]23Cc2ccccc2)c1