Reaction Details
TargetProgesterone receptor
LigandBDBM50113783
Substrate/Competitorn/a
Meas. Tech.ChEMBL_159546 (CHEMBL765662)
Ki>10000±n/a nM
Citation Morgan, BPSwick, AGHargrove, DMLaFlamme, JAMoynihan, MSCarroll, RSMartin, KALee, EDecosta, DBordner, J Discovery of potent, nonsteroidal, and highly selective glucocorticoid receptor antagonists. J Med Chem45:2417-24 (2002) Progesterone receptor
Name:Progesterone receptor
Type:Protein
Mol. Mass.:98979.52
Organism:Homo sapiens (Human)
Description:P06401
Residue:933
BDBM50113783
NameBDBM50113783
Synonyms:(2R,4aS,10aR)-4a-benzyl-2-(chloroethynyl)-1,2,3,4,4a,9,10,10a-octahydrophenanthrene-2,7-diol CHEMBL77779 | CP-394531
TypeSmall organic molecule
Emp. Form.C23H23ClO2
Mol. Mass.366.881
SMILESOc1ccc2c(CC[C@@H]3C[C@](O)(CC[C@@]23Cc2ccccc2)C#CCl)c1