Reaction Details
TargetPolyunsaturated fatty acid lipoxygenase ALOX15
LigandBDBM22372
Substrate/Competitorn/a
Meas. Tech.ChEMBL_20 (CHEMBL615134)
IC50 110±n/a nM
Citation Whitman, SGezginci, MTimmermann, BNHolman, TR Structure-activity relationship studies of nordihydroguaiaretic acid inhibitors toward soybean, 12-human, and 15-human lipoxygenase. J Med Chem45:2659-61 (2002) Polyunsaturated fatty acid lipoxygenase ALOX15
Name:Polyunsaturated fatty acid lipoxygenase ALOX15
Type:Protein
Mol. Mass.:74804.05
Organism:Homo sapiens (Human)
Description:n/a
Residue:662
BDBM22372
NameBDBM22372
Synonyms:4-[(2R,3S)-4-(3,4-dihydroxyphenyl)-2,3-dimethylbutyl]benzene-1,2-diol CHEMBL313972 NDGA | Nordihydroguaiaretic Acid
TypeAntioxidant
Emp. Form.C18H22O4
Mol. Mass.302.3649
SMILESC[C@@H](Cc1ccc(O)c(O)c1)[C@H](C)Cc1ccc(O)c(O)c1