Reaction Details
TargetPolyunsaturated fatty acid lipoxygenase ALOX15
LigandBDBM50065996
Substrate/Competitorn/a
Meas. Tech.ChEMBL_20 (CHEMBL615134)
IC50 250±n/a nM
Citation Whitman, SGezginci, MTimmermann, BNHolman, TR Structure-activity relationship studies of nordihydroguaiaretic acid inhibitors toward soybean, 12-human, and 15-human lipoxygenase. J Med Chem45:2659-61 (2002) Polyunsaturated fatty acid lipoxygenase ALOX15
Name:Polyunsaturated fatty acid lipoxygenase ALOX15
Type:Protein
Mol. Mass.:74804.05
Organism:Homo sapiens (Human)
Description:n/a
Residue:662
BDBM50065996
NameBDBM50065996
Synonyms:4-[(2S,3R)-4-(4-Hydroxy-3-methoxy-phenyl)-2,3-dimethyl-butyl]-benzene-1,2-diol CHEMBL316139
TypeSmall organic molecule
Emp. Form.C19H24O4
Mol. Mass.316.3915
SMILESCOc1cc(C[C@@H](C)[C@@H](C)Cc2ccc(O)c(O)c2)ccc1O