Reaction Details
TargetSeed linoleate 13S-lipoxygenase-1
LigandBDBM50114096
Substrate/Competitorn/a
Meas. Tech.ChEMBL_169 (CHEMBL615381)
IC50 140±n/a nM
Citation Whitman, SGezginci, MTimmermann, BNHolman, TR Structure-activity relationship studies of nordihydroguaiaretic acid inhibitors toward soybean, 12-human, and 15-human lipoxygenase. J Med Chem45:2659-61 (2002) Seed linoleate 13S-lipoxygenase-1
Name:Seed linoleate 13S-lipoxygenase-1
Type:Enzyme
Mol. Mass.:94365.66
Organism:Glycine max (soybean)
Description:n/a
Residue:839
BDBM50114096
NameBDBM50114096
Synonyms:4-ethyl-5-[4-(2-ethyl-4,5-dihydroxyphenyl)-2,3-dimethyl-(2S,3R)-butyl]-1,2-benzenediol | CHEMBL92212
TypeSmall organic molecule
Emp. Form.C22H30O4
Mol. Mass.358.4712
SMILESCCc1cc(O)c(O)cc1C[C@H](C)[C@H](C)Cc1cc(O)c(O)cc1CC