Reaction Details
TargetD(2) dopamine receptor
LigandBDBM50115275
Substrate/Competitorn/a
Meas. Tech.ChEMBL_60235 (CHEMBL671417)
Ki 27±n/a nM
Citation Dijkstra, DRodenhuis, NVermeulen, ESPugsley, TAWise, LDWikström, HV Further characterization of structural requirements for ligands at the dopamine D(2) and D(3) receptor: exploring the thiophene moiety. J Med Chem45:3022-31 (2002) D(2) dopamine receptor
Name:D(2) dopamine receptor
Type:Cell-surface receptors
Mol. Mass.:50647.10
Organism:Homo sapiens (Human)
Description:P14416
Residue:443
BDBM50115275
NameBDBM50115275
Synonyms:CHEMBL103857 | Dipropyl-(4,5,6,7-tetrahydro-benzo[b]thiophen-6-yl)-amine
TypeSmall organic molecule
Emp. Form.C14H23NS
Mol. Mass.237.404
SMILESCCCN(CCC)C1CCc2ccsc2C1