Reaction Details
TargetD(3) dopamine receptor
LigandBDBM50115272
Substrate/Competitorn/a
Meas. Tech.ChEMBL_62294 (CHEMBL872893)
Ki 83±n/a nM
Citation Dijkstra, DRodenhuis, NVermeulen, ESPugsley, TAWise, LDWikström, HV Further characterization of structural requirements for ligands at the dopamine D(2) and D(3) receptor: exploring the thiophene moiety. J Med Chem45:3022-31 (2002) D(3) dopamine receptor
Name:D(3) dopamine receptor
Type:n/a
Mol. Mass.:44243.43
Organism:Homo sapiens (Human)
Description:n/a
Residue:400
BDBM50115272
NameBDBM50115272
Synonyms:4-(2-Thiophen-2-yl-ethyl)-3,4,4a,5,6,10b-hexahydro-2H-naphtho[1,2-b][1,4]oxazin-9-ol | CHEMBL102414
TypeSmall organic molecule
Emp. Form.C18H21NO2S
Mol. Mass.315.43
SMILESOc1ccc2CCC3C(OCCN3CCc3cccs3)c2c1