Reaction Details
TargetD(3) dopamine receptor
LigandBDBM50115283
Substrate/Competitorn/a
Meas. Tech.ChEMBL_62294 (CHEMBL872893)
Ki 12±n/a nM
Citation Dijkstra, DRodenhuis, NVermeulen, ESPugsley, TAWise, LDWikström, HV Further characterization of structural requirements for ligands at the dopamine D(2) and D(3) receptor: exploring the thiophene moiety. J Med Chem45:3022-31 (2002) D(3) dopamine receptor
Name:D(3) dopamine receptor
Type:n/a
Mol. Mass.:44243.43
Organism:Homo sapiens (Human)
Description:n/a
Residue:400
BDBM50115283
NameBDBM50115283
Synonyms:2-Phenyl-4-propyl-3,4,4a,5,6,10b-hexahydro-2H-naphtho[1,2-b][1,4]oxazin-9-ol | CHEMBL322638
TypeSmall organic molecule
Emp. Form.C21H25NO2
Mol. Mass.323.4287
SMILESCCCN1CC(OC2C1CCc1ccc(O)cc21)c1ccccc1