Reaction Details
TargetP2Y purinoceptor 1
LigandBDBM50118217
Substrate/Competitorn/a
Meas. Tech.ChEMBL_147717 (CHEMBL759187)
EC50 1300±n/a nM
Citation Jacobson, KAJarvis, MFWilliams, M Purine and pyrimidine (P2) receptors as drug targets. J Med Chem45:4057-93 (2002) P2Y purinoceptor 1
Name:P2Y purinoceptor 1
Type:n/a
Mol. Mass.:41199.64
Organism:Meleagris gallopavo
Description:n/a
Residue:362
BDBM50118217
NameBDBM50118217
Synonyms:ADENOSINE-5'-DIPHOSPHATE MONOTHIOPHOSPHATE ATPgammaS PHOSPHOTHIOPHOSPHORIC ACID-ADENYLATE ESTER
TypeSmall organic molecule
Emp. Form.C10H16N5O12P3S
Mol. Mass.523.247
SMILESNc1ncnc2n(cnc12)[C@@H]1O[C@H](COP(O)(=O)OP(O)(=O)OP(O)(S)=O)[C@@H](O)[C@H]1O