Reaction Details
TargetP2Y purinoceptor 1
LigandBDBM50118227
Substrate/Competitorn/a
Meas. Tech.ChEMBL_147717 (CHEMBL759187)
EC50 155±n/a nM
Citation Jacobson, KAJarvis, MFWilliams, M Purine and pyrimidine (P2) receptors as drug targets. J Med Chem45:4057-93 (2002) P2Y purinoceptor 1
Name:P2Y purinoceptor 1
Type:n/a
Mol. Mass.:41199.64
Organism:Meleagris gallopavo
Description:n/a
Residue:362
BDBM50118227
NameBDBM50118227
Synonyms:CHEMBL133051 | MRS 2268
TypeSmall organic molecule
Emp. Form.C12H17N5O8P2
Mol. Mass.421.2396
SMILESNc1ncnc2n(cnc12)[C@H]1CC(OP(O)(O)=O)C2(COP(O)(O)=O)CC12