Reaction Details
TargetP2Y purinoceptor 1
LigandBDBM50118243
Substrate/Competitorn/a
Meas. Tech.ChEMBL_147717 (CHEMBL759187)
EC50 4.4±n/a nM
Citation Jacobson, KAJarvis, MFWilliams, M Purine and pyrimidine (P2) receptors as drug targets. J Med Chem45:4057-93 (2002) P2Y purinoceptor 1
Name:P2Y purinoceptor 1
Type:n/a
Mol. Mass.:41199.64
Organism:Meleagris gallopavo
Description:n/a
Residue:362
BDBM50118243
NameBDBM50118243
Synonyms:CHEMBL334823 | MRS 2191
TypeSmall organic molecule
Emp. Form.C14H13ClN3O9PS
Mol. Mass.465.759
SMILESCc1nc(N=Nc2cc(ccc2Cl)S(O)(=O)=O)c(COP(O)(O)=O)c(C=O)c1O