Reaction Details
TargetP2Y purinoceptor 2
LigandBDBM50026893
Substrate/Competitorn/a
Meas. Tech.ChEMBL_147568 (CHEMBL751765)
EC50>100000±n/a nM
Citation Jacobson, KAJarvis, MFWilliams, M Purine and pyrimidine (P2) receptors as drug targets. J Med Chem45:4057-93 (2002) P2Y purinoceptor 2
Name:P2Y purinoceptor 2
Type:PROTEIN
Mol. Mass.:42299.21
Organism:Homo sapiens (Human)
Description:ChEMBL_1455361
Residue:377
BDBM50026893
NameBDBM50026893
Synonyms:CHEMBL3085531
TypeSmall organic molecule
Emp. Form.C13H18ClN5O8P2
Mol. Mass.469.711
SMILESCNc1nc(Cl)nc2n(cnc12)[C@H]1C[C@@H](OP(O)(O)=O)[C@]2(COP(O)(O)=O)C[C@H]12