Reaction Details
TargetP2X purinoceptor 7
LigandBDBM50118235
Substrate/Competitorn/a
Meas. Tech.ChEMBL_147425 (CHEMBL754458)
EC50 400±n/a nM
Citation Jacobson, KAJarvis, MFWilliams, M Purine and pyrimidine (P2) receptors as drug targets. J Med Chem45:4057-93 (2002) P2X purinoceptor 7
Name:P2X purinoceptor 7
Type:Protein
Mol. Mass.:68403.50
Organism:Rattus norvegicus (Rat)
Description:Q64663
Residue:595
BDBM50118235
NameBDBM50118235
Synonyms:Brilliant Blue | CHEMBL423337
TypeSmall organic molecule
Emp. Form.C47H48N3O7S2
Mol. Mass.831.03
SMILESCCOc1ccc(Nc2ccc(cc2)[C+](c2ccc(cc2C)N(CC)Cc2cccc(c2)S([O-])(=O)=O)c2ccc(cc2C)N(CC)Cc2cccc(c2)S([O-])(=O)=O)cc1