Reaction Details
TargetP2X purinoceptor 2
LigandBDBM50064803
Substrate/Competitorn/a
Meas. Tech.ChEMBL_149742 (CHEMBL759525)
EC50 100000±n/a nM
Citation Jacobson, KAJarvis, MFWilliams, M Purine and pyrimidine (P2) receptors as drug targets. J Med Chem45:4057-93 (2002) P2X purinoceptor 2
Name:P2X purinoceptor 2
Type:Enzyme Catalytic Domain
Mol. Mass.:52625.55
Organism:RAT
Description:Purinergic, P2X2 0 RAT::P49653
Residue:472
BDBM50064803
NameBDBM50064803
Synonyms:3-Methyl-7-oxo-5,9-dihydro-6,8-dioxa-2-aza-7lambda*5*-phospha-benzocycloheptene-4,7-diol MRS 2220
TypeSmall organic molecule
Emp. Form.C8H10NO5P
Mol. Mass.231.1425
SMILESCc1ncc2COP(O)(=O)OCc2c1O