Reaction Details
TargetP2X purinoceptor 4
LigandBDBM50118234
Substrate/Competitorn/a
Meas. Tech.ChEMBL_149737 (CHEMBL759520)
IC50 9600±n/a nM
Citation Jacobson, KAJarvis, MFWilliams, M Purine and pyrimidine (P2) receptors as drug targets. J Med Chem45:4057-93 (2002) P2X purinoceptor 4
Name:P2X purinoceptor 4
Type:Enzyme Catalytic Domain
Mol. Mass.:43504.16
Organism:RAT
Description:Purinergic, P2X4 0 RAT::P51577
Residue:388
BDBM50118234
NameBDBM50118234
Synonyms:CHEMBL129904 | MRS 2160
TypeSmall organic molecule
Emp. Form.C15H13ClN3O8P
Mol. Mass.429.706
SMILESCc1nc(N=Nc2ccc(C(O)=O)c(Cl)c2)c(COP(O)(O)=O)c(C=O)c1O