Reaction Details
TargetP2X purinoceptor 7
LigandBDBM50118214
Substrate/Competitorn/a
Meas. Tech.ChEMBL_147425 (CHEMBL754458)
IC50 35000±n/a nM
Citation Jacobson, KAJarvis, MFWilliams, M Purine and pyrimidine (P2) receptors as drug targets. J Med Chem45:4057-93 (2002) P2X purinoceptor 7
Name:P2X purinoceptor 7
Type:Protein
Mol. Mass.:68403.50
Organism:Rattus norvegicus (Rat)
Description:Q64663
Residue:595
BDBM50118214
NameBDBM50118214
Synonyms:CHEMBL133930 | DIDS
TypeSmall organic molecule
Emp. Form.C16H8N2O6S4
Mol. Mass.452.506
SMILES[O-]S(=O)(=O)c1cc(ccc1\C=C\c1ccc(cc1S([O-])(=O)=O)N=C=S)N=C=S