Reaction Details
TargetP2X purinoceptor 2
LigandBDBM50118232
Substrate/Competitorn/a
Meas. Tech.ChEMBL_149743 (CHEMBL760168)
EC50 1500±n/a nM
Citation Jacobson, KAJarvis, MFWilliams, M Purine and pyrimidine (P2) receptors as drug targets. J Med Chem45:4057-93 (2002) P2X purinoceptor 2
Name:P2X purinoceptor 2
Type:Enzyme Catalytic Domain
Mol. Mass.:52625.55
Organism:RAT
Description:Purinergic, P2X2 0 RAT::P49653
Residue:472
BDBM50118232
NameBDBM50118232
Synonyms:2-MeSATP CHEMBL336208
TypeSmall organic molecule
Emp. Form.C11H18N5O13P3S
Mol. Mass.553.273
SMILESCSc1nc(N)c2ncn([C@@H]3O[C@H](COP(O)(=O)OP(O)(=O)OP(O)(O)=O)[C@@H](O)[C@H]3O)c2n1