Reaction Details
TargetP2X purinoceptor 2
LigandBDBM50118226
Substrate/Competitorn/a
Meas. Tech.ChEMBL_147393 (CHEMBL751802)
EC50 10000±n/a nM
Citation Jacobson, KAJarvis, MFWilliams, M Purine and pyrimidine (P2) receptors as drug targets. J Med Chem45:4057-93 (2002) P2X purinoceptor 2
Name:P2X purinoceptor 2
Type:Enzyme Catalytic Domain
Mol. Mass.:52625.55
Organism:RAT
Description:Purinergic, P2X2 0 RAT::P49653
Residue:472
BDBM50118226
NameBDBM50118226
Synonyms:CHEMBL337062 | PAPET-ATP
TypeSmall organic molecule
Emp. Form.C18H25N6O13P3S
Mol. Mass.658.41
SMILESNc1ccc(CCSc2nc(N)c3ncn([C@@H]4O[C@H](COP(O)(=O)OP(O)(=O)OP(O)(O)=O)[C@@H](O)[C@H]4O)c3n2)cc1