Reaction Details
TargetP2X purinoceptor 2
LigandBDBM50118228
Substrate/Competitorn/a
Meas. Tech.ChEMBL_147394 (CHEMBL857685)
IC50>50000±n/a nM
Citation Jacobson, KAJarvis, MFWilliams, M Purine and pyrimidine (P2) receptors as drug targets. J Med Chem45:4057-93 (2002) P2X purinoceptor 2
Name:P2X purinoceptor 2
Type:Enzyme Catalytic Domain
Mol. Mass.:52625.55
Organism:RAT
Description:Purinergic, P2X2 0 RAT::P49653
Residue:472
BDBM50118228
NameBDBM50118228
Synonyms:5,7-Disulfo-4-(3-{3-[3-(4,6,8-trisulfo-naphthalen-1-ylcarbamoyl)-phenyl]-ureido}-benzoylamino)-naphthalene-1-sulfonic acid anion;hexasodium salt Urea derivative
TypeSmall organic molecule
Emp. Form.C35H20N4O21S6
Mol. Mass.1024.941
SMILES[O-]S(=O)(=O)c1cc(c2c(NC(=O)c3cccc(NC(=O)Nc4cccc(c4)C(=O)Nc4ccc(c5cc(cc(c45)S([O-])(=O)=O)S([O-])(=O)=O)S([O-])(=O)=O)c3)ccc(c2c1)S([O-])(=O)=O)S([O-])(=O)=O