Reaction Details
TargetP2X purinoceptor 2
LigandBDBM50118217
Substrate/Competitorn/a
Meas. Tech.ChEMBL_149743 (CHEMBL760168)
EC50 1500±n/a nM
Citation Jacobson, KAJarvis, MFWilliams, M Purine and pyrimidine (P2) receptors as drug targets. J Med Chem45:4057-93 (2002) P2X purinoceptor 2
Name:P2X purinoceptor 2
Type:Enzyme Catalytic Domain
Mol. Mass.:52625.55
Organism:RAT
Description:Purinergic, P2X2 0 RAT::P49653
Residue:472
BDBM50118217
NameBDBM50118217
Synonyms:ADENOSINE-5'-DIPHOSPHATE MONOTHIOPHOSPHATE ATPgammaS PHOSPHOTHIOPHOSPHORIC ACID-ADENYLATE ESTER
TypeSmall organic molecule
Emp. Form.C10H16N5O12P3S
Mol. Mass.523.247
SMILESNc1ncnc2n(cnc12)[C@@H]1O[C@H](COP(O)(=O)OP(O)(=O)OP(O)(S)=O)[C@@H](O)[C@H]1O