Reaction Details
TargetP2X purinoceptor 2
LigandBDBM50118240
Substrate/Competitorn/a
Meas. Tech.ChEMBL_147393 (CHEMBL751802)
EC50 180000±n/a nM
Citation Jacobson, KAJarvis, MFWilliams, M Purine and pyrimidine (P2) receptors as drug targets. J Med Chem45:4057-93 (2002) P2X purinoceptor 2
Name:P2X purinoceptor 2
Type:Enzyme Catalytic Domain
Mol. Mass.:52625.55
Organism:RAT
Description:Purinergic, P2X2 0 RAT::P49653
Residue:472
BDBM50118240
NameBDBM50118240
Synonyms:((2R,3S,4R,5R)-5-(6-amino-2-(hexylthio)-9H-purin-9-yl)-3,4-dihydroxytetrahydrofuran-2-yl)methyl dihydrogen phosphate HT-AMP
TypeSmall organic molecule
Emp. Form.C16H26N5O7PS
Mol. Mass.463.446
SMILESCCCCCCSc1nc(N)c2ncn([C@@H]3O[C@H](COP(O)(O)=O)[C@@H](O)[C@H]3O)c2n1