Reaction Details
TargetP2X purinoceptor 2
LigandBDBM50118243
Substrate/Competitorn/a
Meas. Tech.ChEMBL_149743 (CHEMBL760168)
EC50 1.1±n/a nM
Citation Jacobson, KAJarvis, MFWilliams, M Purine and pyrimidine (P2) receptors as drug targets. J Med Chem45:4057-93 (2002) P2X purinoceptor 2
Name:P2X purinoceptor 2
Type:Enzyme Catalytic Domain
Mol. Mass.:52625.55
Organism:RAT
Description:Purinergic, P2X2 0 RAT::P49653
Residue:472
BDBM50118243
NameBDBM50118243
Synonyms:CHEMBL334823 | MRS 2191
TypeSmall organic molecule
Emp. Form.C14H13ClN3O9PS
Mol. Mass.465.759
SMILESCc1nc(N=Nc2cc(ccc2Cl)S(O)(=O)=O)c(COP(O)(O)=O)c(C=O)c1O