Reaction Details
TargetP2Y purinoceptor 1
LigandBDBM50118239
Substrate/Competitorn/a
Meas. Tech.ChEMBL_147578 (CHEMBL750156)
EC50>100000±n/a nM
Citation Jacobson, KAJarvis, MFWilliams, M Purine and pyrimidine (P2) receptors as drug targets. J Med Chem45:4057-93 (2002) P2Y purinoceptor 1
Name:P2Y purinoceptor 1
Type:Enzyme
Mol. Mass.:42090.25
Organism:Homo sapiens (Human)
Description:P47900
Residue:373
BDBM50118239
NameBDBM50118239
Synonyms:CHEMBL130266 Uridine diphosphate | uridine 5'-(trihydrogen diphosphate)
TypeSmall organic molecule
Emp. Form.C9H14N2O12P2
Mol. Mass.404.1612
SMILESO[C@@H]1[C@@H](COP(O)(=O)OP(O)(O)=O)O[C@H]([C@@H]1O)n1ccc(=O)[nH]c1=O