Reaction Details
TargetP2X purinoceptor 2
LigandBDBM50118221
Substrate/Competitorn/a
Meas. Tech.ChEMBL_149743 (CHEMBL760168)
EC50 100000±n/a nM
Citation Jacobson, KAJarvis, MFWilliams, M Purine and pyrimidine (P2) receptors as drug targets. J Med Chem45:4057-93 (2002) P2X purinoceptor 2
Name:P2X purinoceptor 2
Type:Enzyme Catalytic Domain
Mol. Mass.:52625.55
Organism:RAT
Description:Purinergic, P2X2 0 RAT::P49653
Residue:472
BDBM50118221
NameBDBM50118221
Synonyms:9H-purine derivative DIPHOSPHOMETHYLPHOSPHONIC ACID ADENOSYL ESTER | alpha,beta-meATP
TypeSmall organic molecule
Emp. Form.C11H18N5O12P3
Mol. Mass.505.2082
SMILESNc1ncnc2n(cnc12)[C@@H]1O[C@H](COP(O)(=O)CP(O)(=O)OP(O)(O)=O)[C@@H](O)[C@H]1O