Reaction Details
TargetP2X purinoceptor 3
LigandBDBM50370142
Substrate/Competitorn/a
Meas. Tech.ChEMBL_147404 (CHEMBL750978)
EC50 9200±n/a nM
Citation Jacobson, KAJarvis, MFWilliams, M Purine and pyrimidine (P2) receptors as drug targets. J Med Chem45:4057-93 (2002) P2X purinoceptor 3
Name:P2X purinoceptor 3
Type:Protein
Mol. Mass.:44292.02
Organism:Homo sapiens (Human)
Description:P56373
Residue:397
BDBM50370142
NameBDBM50370142
Synonyms:CHEMBL133463
TypeSmall organic molecule
Emp. Form.C11H18N5O12P3
Mol. Mass.505.2082
SMILESNc1ncnc2n(cnc12)[C@@H]1O[C@H](CO[P@](O)(=O)O[P@](O)(=O)CP(O)(O)=O)[C@@H](O)[C@H]1O