Reaction Details
TargetLymphotoxin-alpha
LigandBDBM50118214
Substrate/Competitorn/a
Meas. Tech.ChEMBL_147570 (CHEMBL751767)
Kd 10000±n/a nM
Citation Jacobson, KAJarvis, MFWilliams, M Purine and pyrimidine (P2) receptors as drug targets. J Med Chem45:4057-93 (2002) Lymphotoxin-alpha
Name:Lymphotoxin-alpha
Type:PROTEIN
Mol. Mass.:22305.04
Organism:Homo sapiens (Human)
Description:ChEMBL_147570
Residue:205
BDBM50118214
NameBDBM50118214
Synonyms:CHEMBL133930 | DIDS
TypeSmall organic molecule
Emp. Form.C16H8N2O6S4
Mol. Mass.452.506
SMILES[O-]S(=O)(=O)c1cc(ccc1\C=C\c1ccc(cc1S([O-])(=O)=O)N=C=S)N=C=S