Reaction Details
TargetP2Y purinoceptor 4
LigandBDBM50118220
Substrate/Competitorn/a
Meas. Tech.ChEMBL_147881 (CHEMBL757043)
EC50 3000±n/a nM
Citation Jacobson, KAJarvis, MFWilliams, M Purine and pyrimidine (P2) receptors as drug targets. J Med Chem45:4057-93 (2002) P2Y purinoceptor 4
Name:P2Y purinoceptor 4
Type:PROTEIN
Mol. Mass.:40908.48
Organism:Rattus norvegicus
Description:ChEMBL_147880
Residue:361
BDBM50118220
NameBDBM50118220
Synonyms:(ppA)2 CHEMBL339385 adenosine(5')tetraphospho(5')adenosine | bis(5'-adenylyl) diphosphate
TypeSmall organic molecule
Emp. Form.C20H28N10O19P4
Mol. Mass.836.387
SMILESNc1ncnc2n(cnc12)[C@@H]1O[C@H](COP(O)(=O)OP(O)(=O)OP(O)(=O)OP(O)(=O)OC[C@H]2O[C@H]([C@H](O)[C@@H]2O)n2cnc3c(N)ncnc23)[C@@H](O)[C@H]1O