Reaction Details
TargetP2X purinoceptor 1
LigandBDBM50118245
Substrate/Competitorn/a
Meas. Tech.ChEMBL_149733 (CHEMBL759516)
IC50 1600±n/a nM
Citation Jacobson, KAJarvis, MFWilliams, M Purine and pyrimidine (P2) receptors as drug targets. J Med Chem45:4057-93 (2002) P2X purinoceptor 1
Name:P2X purinoceptor 1
Type:Enzyme Catalytic Domain
Mol. Mass.:44969.95
Organism:RAT
Description:Purinergic, P2X1 0 RAT::P47824
Residue:399
BDBM50118245
NameBDBM50118245
Synonyms:CHEMBL133572 | MG 40-3
TypeSmall organic molecule
Emp. Form.C23H12Cl2N6O8S2
Mol. Mass.635.414
SMILESNc1c(cc(Nc2ccc(Nc3nc(Cl)nc(Cl)n3)cc2S([O-])(=O)=O)c2C(=O)c3ccccc3C(=O)c12)S([O-])(=O)=O