Reaction Details
TargetSodium-dependent noradrenaline transporter
LigandBDBM50118263
Substrate/Competitorn/a
Meas. Tech.ChEMBL_145004 (CHEMBL756266)
Ki 23±n/a nM
Citation Houlihan, WJKelly, LPankuch, JKoletar, JBrand, LJanowsky, AKopajtic, TA Mazindol analogues as potential inhibitors of the cocaine binding site at the dopamine transporter. J Med Chem45:4097-109 (2002) Sodium-dependent noradrenaline transporter
Name:Sodium-dependent noradrenaline transporter
Type:Multi-pass membrane protein
Mol. Mass.:69337.72
Organism:Homo sapiens (Human)
Description:P23975
Residue:617
BDBM50118263
NameBDBM50118263
Synonyms:5-(4-Chloro-phenyl)-7-methoxy-2,5-dihydro-3H-imidazo[2,1-a]isoindol-5-ol | CHEMBL132082
TypeSmall organic molecule
Emp. Form.C17H15ClN2O2
Mol. Mass.314.766
SMILESCOc1ccc2C3=NCCN3C(O)(c2c1)c1ccc(Cl)cc1