Reaction Details
TargetSodium-dependent dopamine transporter
LigandBDBM50118272
Substrate/Competitorn/a
Meas. Tech.ChEMBL_61503 (CHEMBL672997)
IC50 91±n/a nM
Citation Houlihan, WJKelly, LPankuch, JKoletar, JBrand, LJanowsky, AKopajtic, TA Mazindol analogues as potential inhibitors of the cocaine binding site at the dopamine transporter. J Med Chem45:4097-109 (2002) Sodium-dependent dopamine transporter
Name:Sodium-dependent dopamine transporter
Type:Multi-pass membrane protein
Mol. Mass.:68497.11
Organism:Homo sapiens (Human)
Description:Q01959
Residue:620
BDBM50118272
NameBDBM50118272
Synonyms:5-(4-Chloro-phenyl)-9-fluoro-2,5-dihydro-3H-imidazo[2,1-a]isoindol-5-ol | CHEMBL336100
TypeSmall organic molecule
Emp. Form.C16H12ClFN2O
Mol. Mass.302.731
SMILESOC1(N2CCN=C2c2c1cccc2F)c1ccc(Cl)cc1