Reaction Details
TargetThymidine kinase, cytosolic
LigandBDBM50118488
Substrate/Competitorn/a
Meas. Tech.ChEMBL_208013 (CHEMBL816093)
IC50 13000±n/a nM
Citation Hernández, AIBalzarini, JKarlsson, ACamarasa, MJPérez-Pérez, MJ Acyclic nucleoside analogues as novel inhibitors of human mitochondrial thymidine kinase. J Med Chem45:4254-63 (2002) Thymidine kinase, cytosolic
Name:Thymidine kinase, cytosolic
Type:PROTEIN
Mol. Mass.:25476.50
Organism:Homo sapiens (Human)
Description:ChEMBL_1333884
Residue:234
BDBM50118488
NameBDBM50118488
Synonyms:1-(2,3-Dihydroxy-4-trityloxy-butyl)-5-methyl-1H-pyrimidine-2,4-dione | CHEMBL135863
TypeSmall organic molecule
Emp. Form.C28H28N2O5
Mol. Mass.472.5323
SMILESCc1cn(CC(O)C(O)COC(c2ccccc2)(c2ccccc2)c2ccccc2)c(=O)[nH]c1=O