Reaction Details
TargetThymidine kinase, cytosolic
LigandBDBM50118503
Substrate/Competitorn/a
Meas. Tech.ChEMBL_210617 (CHEMBL811734)
IC50 4600±n/a nM
Citation Hernández, AIBalzarini, JKarlsson, ACamarasa, MJPérez-Pérez, MJ Acyclic nucleoside analogues as novel inhibitors of human mitochondrial thymidine kinase. J Med Chem45:4254-63 (2002) Thymidine kinase, cytosolic
Name:Thymidine kinase, cytosolic
Type:PROTEIN
Mol. Mass.:25476.50
Organism:Homo sapiens (Human)
Description:ChEMBL_1333884
Residue:234
BDBM50118503
NameBDBM50118503
Synonyms:5-Iodo-1-(3-trityloxy-propenyl)-1H-pyrimidine-2,4-dione | CHEMBL337264
TypeSmall organic molecule
Emp. Form.C26H21IN2O3
Mol. Mass.536.361
SMILESIc1cn(\C=C/COC(c2ccccc2)(c2ccccc2)c2ccccc2)c(=O)[nH]c1=O