Reaction Details
TargetThymidine kinase, cytosolic
LigandBDBM50118506
Substrate/Competitorn/a
Meas. Tech.ChEMBL_210617 (CHEMBL811734)
IC50 4600±n/a nM
Citation Hernández, AIBalzarini, JKarlsson, ACamarasa, MJPérez-Pérez, MJ Acyclic nucleoside analogues as novel inhibitors of human mitochondrial thymidine kinase. J Med Chem45:4254-63 (2002) Thymidine kinase, cytosolic
Name:Thymidine kinase, cytosolic
Type:PROTEIN
Mol. Mass.:25476.50
Organism:Homo sapiens (Human)
Description:ChEMBL_1333884
Residue:234
BDBM50118506
NameBDBM50118506
Synonyms:CHEMBL335866 | Diphenyl-acetic acid 4-(5-methyl-2,4-dioxo-3,4-dihydro-2H-pyrimidin-1-yl)-but-2-enyl ester
TypeSmall organic molecule
Emp. Form.C23H22N2O4
Mol. Mass.390.4318
SMILESCc1cn(C\C=C/COC(=O)C(c2ccccc2)c2ccccc2)c(=O)[nH]c1=O