Reaction Details
TargetCarbonic anhydrase 1
LigandBDBM50108563
Substrate/Competitorn/a
Meas. Tech.ChEMBL_47501 (CHEMBL662728)
Ki 850±n/a nM
Citation Masereel, BRolin, SAbbate, FScozzafava, ASupuran, CT Carbonic anhydrase inhibitors: anticonvulsant sulfonamides incorporating valproyl and other lipophilic moieties. J Med Chem45:312-20 (2002) Carbonic anhydrase 1
Name:Carbonic anhydrase 1
Type:Enzyme
Mol. Mass.:28873.37
Organism:Homo sapiens (Human)
Description:P00915
Residue:261
BDBM50108563
NameBDBM50108563
Synonyms:Adamantane-1-carboxylic acid (5-sulfamoyl-[1,3,4]thiadiazol-2-yl)-amide | CHEMBL108971
TypeSmall organic molecule
Emp. Form.C13H18N4O3S2
Mol. Mass.342.437
SMILESNS(=O)(=O)c1nnc(NC(=O)C23C[C@H]4C[C@H](C[C@H](C4)C2)C3)s1