Reaction Details
TargetCarbonic anhydrase 2
LigandBDBM10888
Substrate/Competitorn/a
Meas. Tech.ChEMBL_45048 (CHEMBL658046)
Ki 4300±n/a nM
Citation Masereel, BRolin, SAbbate, FScozzafava, ASupuran, CT Carbonic anhydrase inhibitors: anticonvulsant sulfonamides incorporating valproyl and other lipophilic moieties. J Med Chem45:312-20 (2002) Carbonic anhydrase 2
Name:Carbonic anhydrase 2
Type:Enzyme
Mol. Mass.:29250.71
Organism:Homo sapiens (Human)
Description:P00918
Residue:260
BDBM10888
NameBDBM10888
Synonyms:1,2-benzoxazol-3-ylmethanesulfonamide SPR_2 Zonisamide Zonisamide (ZNS) Zonisamide, ZNS
TypeSmall organic molecule
Emp. Form.C8H8N2O3S
Mol. Mass.212.226
SMILESNS(=O)(=O)Cc1noc2ccccc12