Reaction Details
Target5-hydroxytryptamine receptor 2A
LigandBDBM50108595
Substrate/Competitorn/a
Meas. Tech.ChEMBL_2661 (CHEMBL617910)
Ki 12±n/a nM
Citation Campiani, GButini, SGemma, SNacci, VFattorusso, CCatalanotti, BGiorgi, GCagnotto, AGoegan, MMennini, TMinetti, PDi Cesare, MAMastroianni, DScafetta, NGalletti, BStasi, MACastorina, MPacifici, LGhirardi, OTinti, OCarminati, P Pyrrolo[1,3]benzothiazepine-based atypical antipsychotic agents. Synthesis, structure-activity relationship, molecular modeling, and biological studies. J Med Chem45:344-59 (2002) 5-hydroxytryptamine receptor 2A
Name:5-hydroxytryptamine receptor 2A
Type:G Protein-Coupled Receptor (GPCR)
Mol. Mass.:52852.05
Organism:Rattus norvegicus (rat)
Description:Rat cortex membranes 5-HT2A receptors.
Residue:471
BDBM50108595
NameBDBM50108595
Synonyms:(+/-)7-Bromo-9-(4-methyl-piperazin-1-yl)-9,10-dihydro-4-thia-10a-aza-benzo[f]azulene | CHEMBL121274
TypeSmall organic molecule
Emp. Form.C17H20BrN3S
Mol. Mass.378.33
SMILESCN1CCN(CC1)C1Cn2cccc2Sc2ccc(Br)cc12