Reaction Details
TargetD(3) dopamine receptor
LigandBDBM50108594
Substrate/Competitorn/a
Meas. Tech.ChEMBL_62766 (CHEMBL676293)
Ki 10±n/a nM
Citation Campiani, GButini, SGemma, SNacci, VFattorusso, CCatalanotti, BGiorgi, GCagnotto, AGoegan, MMennini, TMinetti, PDi Cesare, MAMastroianni, DScafetta, NGalletti, BStasi, MACastorina, MPacifici, LGhirardi, OTinti, OCarminati, P Pyrrolo[1,3]benzothiazepine-based atypical antipsychotic agents. Synthesis, structure-activity relationship, molecular modeling, and biological studies. J Med Chem45:344-59 (2002) D(3) dopamine receptor
Name:D(3) dopamine receptor
Type:Protein
Mol. Mass.:49540.58
Organism:Rattus norvegicus (Rat)
Description:P19020
Residue:446
BDBM50108594
NameBDBM50108594
Synonyms:(+/-)2-[4-(7-Bromo-9,10-dihydro-4-thia-10a-aza-benzo[f]azulen-9-yl)-piperazin-1-yl]-ethanol | CHEMBL116542
TypeSmall organic molecule
Emp. Form.C18H22BrN3OS
Mol. Mass.408.356
SMILESOCCN1CCN(CC1)C1Cn2cccc2Sc2ccc(Br)cc12